BDBM5871 2-Anilino-5-aryloxazole 35::5-(3-Ethylphenyl)-N-[5-(ethylsulfonyl)-2-methoxyphenyl]-1,3-oxazol-2-amine::N-[5-(ethanesulfonyl)-2-methoxyphenyl]-5-(3-ethylphenyl)-1,3-oxazol-2-amine
SMILES CCc1cccc(c1)-c1cnc(Nc2cc(ccc2OC)S(=O)(=O)CC)o1
InChI Key InChIKey=OWRNZCGLKGYOBT-UHFFFAOYSA-N
Data  1 IC50
  Tab Delimited (TSV)   2D SDfile   Computed 3D by Vconf -m prep SDfile
Find this compound or compounds like it in BindingDB:
Activity Spreadsheet -- Enzyme Inhibition Constant Data from BindingDB
Found 1 hit for monomerid = 5871
TargetVascular endothelial growth factor receptor 2(Homo sapiens (Human))
Glaxosmithkline
LigandPNGBDBM5871(2-Anilino-5-aryloxazole 35 | 5-(3-Ethylphenyl)-N-[...)
Affinity DataIC50:  29nM. Assay description: The assay was using baculovirus-expressed recombinant protein kinase purified as the intracellular domain fused by GST tag, interacting with biotinyl...
In DepthDetails ArticlePubMed