BDBM5878 2-Anilino-5-aryloxazole 42::N-[5-(Ethylsulfonyl)-2-methoxyphenyl]-5-[3-(1-methyl-1H-imidazol-5-yl)phenyl]-1,3-oxazol-2-amine::N-[5-(ethanesulfonyl)-2-methoxyphenyl]-5-[3-(1-methyl-1H-imidazol-5-yl)phenyl]-1,3-oxazol-2-amine
SMILES CCS(=O)(=O)c1ccc(OC)c(Nc2ncc(o2)-c2cccc(c2)-c2cncn2C)c1
InChI Key InChIKey=PQZKVWILKSYPCO-UHFFFAOYSA-N
Data  1 IC50
  Tab Delimited (TSV)   2D SDfile   Computed 3D by Vconf -m prep SDfile
Find this compound or compounds like it in BindingDB:
Activity Spreadsheet -- Enzyme Inhibition Constant Data from BindingDB
Found 1 hit for monomerid = 5878
TargetVascular endothelial growth factor receptor 2(Homo sapiens (Human))
Glaxosmithkline
LigandPNGBDBM5878(2-Anilino-5-aryloxazole 42 | N-[5-(Ethylsulfonyl)-...)
Affinity DataIC50:  25nM. Assay description: The assay was using baculovirus-expressed recombinant protein kinase purified as the intracellular domain fused by GST tag, interacting with biotinyl...
In DepthDetails ArticlePubMed