BDBM59527 (5E)-1-(2-furanylmethyl)-5-[(E)-3-(2-furanyl)prop-2-enylidene]-1,3-diazinane-2,4,6-trione::(5E)-1-(2-furfuryl)-5-[(E)-3-(2-furyl)prop-2-enylidene]barbituric acid::(5E)-1-(furan-2-ylmethyl)-5-[(E)-3-(furan-2-yl)prop-2-enylidene]-1,3-diazinane-2,4,6-trione::1-Furan-2-ylmethyl-5-[(E)-3-furan-2-yl-prop-2-en-(E)-ylidene]-pyrimidine-2,4,6-trione::MLS000587064::SMR000211100::cid_1918388
SMILES O=C1NC(=O)\C(=C/C=C/c2ccco2)C(=O)N1Cc1ccco1
InChI Key InChIKey=RNVCZUVVNHJQAA-NYNQDTEKSA-N
Data  5 IC50  1 EC50
  Tab Delimited (TSV)   2D SDfile   Computed 3D by Vconf -m prep SDfile
Find this compound or compounds like it in BindingDB:
Activity Spreadsheet -- Enzyme Inhibition Constant Data from BindingDB
Found 6 hits for monomerid = 59527
TargetNucleotide-binding oligomerization domain-containing protein 1(Homo sapiens (Human))
Burnham Center For Chemical Genomics
Curated by PubChem BioAssay
LigandPNGBDBM59527((5E)-1-(2-furanylmethyl)-5-[(E)-3-(2-furanyl)prop-...)
Affinity DataEC50:  2.00E+4nM. Assay description: Data Source: Sanford-Burnham Center for Chemical Genomics (SBCCG) Source Affiliation: Sanford-Burnham Medical Research Institute (SBMRI, San Diego, C...
In DepthDetails PCBioAssay
TargetTumor necrosis factor(Homo sapiens (Human))
Burnham Center For Chemical Genomics
Curated by PubChem BioAssay
LigandPNGBDBM59527((5E)-1-(2-furanylmethyl)-5-[(E)-3-(2-furanyl)prop-...)
Affinity DataIC50:  1.62E+4nM. Assay description: Data Source: Sanford-Burnham Center for Chemical Genomics (SBCCG) Source Affiliation: Sanford-Burnham Medical Research Institute (SBMRI, San Diego, C...
In DepthDetails PCBioAssay
TargetDNA-(apurinic or apyrimidinic site) endonuclease(Homo sapiens (Human))
Russian Academy Of Sciences
Curated by ChEMBL
LigandPNGBDBM59527((5E)-1-(2-furanylmethyl)-5-[(E)-3-(2-furanyl)prop-...)
Affinity DataIC50:  2.80E+3nM. Assay description: Inhibition of human APE1 using a 5'-TAMRA labelled THF abasic site double-stranded oligodeoxynucleotide as substrate in presence of Mg2+ by fluoresce...
In DepthDetails ArticlePubMed
TargetX-box-binding protein 1(Homo sapiens (Human))
Emory University
Curated by PubChem BioAssay
LigandPNGBDBM59527((5E)-1-(2-furanylmethyl)-5-[(E)-3-(2-furanyl)prop-...)
Affinity DataIC50:  320nM. Assay description: NIH Molecular Libraries Screening Centers Network [MLSCN] Emory Chemical Biology Discovery Center in MLSCN Assay provider: Dr. Randal Kaufman, Univer...
In DepthDetails PCBioAssay
TargetDNA damage-inducible transcript 3 protein(Mus musculus)
Emory University
Curated by PubChem BioAssay
LigandPNGBDBM59527((5E)-1-(2-furanylmethyl)-5-[(E)-3-(2-furanyl)prop-...)
Affinity DataIC50:  1.83E+3nM. Assay description: NIH Molecular Libraries Screening Centers Network [MLSCN] Emory Chemical Biology Discovery Center in MLSCN Assay provider: Dr. Randal Kaufman, Univer...
In DepthDetails PCBioAssay
TargetDNA damage-inducible transcript 3 protein(Mus musculus)
Emory University
Curated by PubChem BioAssay
LigandPNGBDBM59527((5E)-1-(2-furanylmethyl)-5-[(E)-3-(2-furanyl)prop-...)
Affinity DataIC50:  1.83E+3nM. Assay description: NIH Molecular Libraries Screening Centers Network [MLSCN] Emory Chemical Biology Discovery Center in MLSCN Assay provider: Dr. Randal Kaufman, Univer...
In DepthDetails PCBioAssay