BDBM59709 4-chloro-3-[[1-oxo-2-(1H-1,2,4-triazol-5-ylthio)ethyl]amino]benzoic acid methyl ester::4-chloro-3-[[2-(1H-1,2,4-triazol-5-ylthio)acetyl]amino]benzoic acid methyl ester::MLS000100135::SMR000081949::cid_1255917::methyl 4-chloranyl-3-[2-(1H-1,2,4-triazol-5-ylsulfanyl)ethanoylamino]benzoate::methyl 4-chloro-3-[[2-(1H-1,2,4-triazol-5-ylsulfanyl)acetyl]amino]benzoate::methyl 4-chloro-3-{[(4H-1,2,4-triazol-3-ylthio)acetyl]amino}benzoate
SMILES COC(=O)c1ccc(Cl)c(NC(=O)CSc2nnc[nH]2)c1
InChI Key InChIKey=XPKQIWYGFHKQDQ-UHFFFAOYSA-N
Data  1 IC50
  Tab Delimited (TSV)   2D SDfile   Computed 3D by Vconf -m prep SDfile
Find this compound or compounds like it in BindingDB:
Activity Spreadsheet -- Enzyme Inhibition Constant Data from BindingDB
Found 1 hit for monomerid = 59709
TargetM17 leucyl aminopeptidase(Plasmodium falciparum 3D7)
Srmlsc
Curated by PubChem BioAssay
LigandPNGBDBM59709(4-chloro-3-[[1-oxo-2-(1H-1,2,4-triazol-5-ylthio)et...)
Affinity DataIC50:  3.51E+4nM. Assay description: Southern Research Molecular Libraries Screening Center (SRMLSC) Southern Research Institute (Birmingham, Alabama) NIH Molecular Libraries Screening...
In DepthDetails PCBioAssay