BDBM62270 MLS-0380219.0001::N-[1-(2,4-difluorophenyl)-4,5,6,7-tetrahydroindazol-4-yl]-2-methyl-3-pyrazolecarboxamide::N-[1-(2,4-difluorophenyl)-4,5,6,7-tetrahydroindazol-4-yl]-2-methyl-pyrazole-3-carboxamide::N-[1-(2,4-difluorophenyl)-4,5,6,7-tetrahydroindazol-4-yl]-2-methylpyrazole-3-carboxamide::N-[1-[2,4-bis(fluoranyl)phenyl]-4,5,6,7-tetrahydroindazol-4-yl]-2-methyl-pyrazole-3-carboxamide::cid_24793944
SMILES Cn1nccc1C(=O)NC1CCCc2c1cnn2-c1ccc(F)cc1F
InChI Key InChIKey=GXLKSVCDXUMIAV-UHFFFAOYSA-N
Data  3 IC50
  Tab Delimited (TSV)   2D SDfile   Computed 3D by Vconf -m prep SDfile
Find this compound or compounds like it in BindingDB:
Activity Spreadsheet -- Enzyme Inhibition Constant Data from BindingDB
Found 3 hits for monomerid = 62270
TargetNucleotide-binding oligomerization domain-containing protein 1(Homo sapiens (Human))
Burnham Center For Chemical Genomics
Curated by PubChem BioAssay
LigandPNGBDBM62270(MLS-0380219.0001 | N-[1-(2,4-difluorophenyl)-4,5,6...)
Affinity DataIC50:  677nM. Assay description: Data Source: Sanford-Burnham Center for Chemical Genomics (SBCCG) Source Affiliation: Sanford-Burnham Medical Research Institute (SBMRI, San Diego, C...
In DepthDetails PCBioAssay
TargetGalanin receptor type 3(Homo sapiens (Human))
The Scripps Research Institute Molecular Screening Center
Curated by PubChem BioAssay
LigandPNGBDBM62270(MLS-0380219.0001 | N-[1-(2,4-difluorophenyl)-4,5,6...)
Affinity DataIC50:  240nM
In DepthDetails PCBioAssay
TargetTumor necrosis factor(Homo sapiens (Human))
Burnham Center For Chemical Genomics
Curated by PubChem BioAssay
LigandPNGBDBM62270(MLS-0380219.0001 | N-[1-(2,4-difluorophenyl)-4,5,6...)
Affinity DataIC50:  712nM. Assay description: Data Source: Sanford-Burnham Center for Chemical Genomics (SBCCG) Source Affiliation: Sanford-Burnham Medical Research Institute (SBMRI, San Diego, C...
In DepthDetails PCBioAssay