BDBM62350 2-[(3-fluorobenzoyl)amino]-6-methyl-4,5,6,7-tetrahydrobenzothiophene-3-carboxylic acid methyl ester::2-[[(3-fluorophenyl)-oxomethyl]amino]-6-methyl-4,5,6,7-tetrahydro-1-benzothiophene-3-carboxylic acid methyl ester::MLS-0435419.0001::cid_3111236::methyl 2-[(3-fluorobenzoyl)amino]-6-methyl-4,5,6,7-tetrahydro-1-benzothiophene-3-carboxylate::methyl 2-[(3-fluorophenyl)carbonylamino]-6-methyl-4,5,6,7-tetrahydro-1-benzothiophene-3-carboxylate
SMILES COC(=O)c1c(NC(=O)c2cccc(F)c2)sc2CC(C)CCc12
InChI Key InChIKey=BEUPHCIEQJCRAZ-UHFFFAOYSA-N
Data  3 IC50
  Tab Delimited (TSV)   2D SDfile   Computed 3D by Vconf -m prep SDfile
Find this compound or compounds like it in BindingDB:
Activity Spreadsheet -- Enzyme Inhibition Constant Data from BindingDB
Found 3 hits for monomerid = 62350
TargetNucleotide-binding oligomerization domain-containing protein 1(Homo sapiens (Human))
Burnham Center For Chemical Genomics
Curated by PubChem BioAssay
LigandPNGBDBM62350(2-[(3-fluorobenzoyl)amino]-6-methyl-4,5,6,7-tetrah...)
Affinity DataIC50:  2.00E+4nM. Assay description: Data Source: Sanford-Burnham Center for Chemical Genomics (SBCCG) Source Affiliation: Sanford-Burnham Medical Research Institute (SBMRI, San Diego, C...
In DepthDetails PCBioAssay
TargetTumor necrosis factor(Homo sapiens (Human))
Burnham Center For Chemical Genomics
Curated by PubChem BioAssay
LigandPNGBDBM62350(2-[(3-fluorobenzoyl)amino]-6-methyl-4,5,6,7-tetrah...)
Affinity DataIC50: >2.00E+4nM. Assay description: Data Source: Sanford-Burnham Center for Chemical Genomics (SBCCG) Source Affiliation: Sanford-Burnham Medical Research Institute (SBMRI, San Diego, C...
In DepthDetails PCBioAssay
TargetNucleotide-binding oligomerization domain-containing protein 2(Homo sapiens (Human))
Burnham Center For Chemical Genomics
Curated by PubChem BioAssay
LigandPNGBDBM62350(2-[(3-fluorobenzoyl)amino]-6-methyl-4,5,6,7-tetrah...)
Affinity DataIC50:  2.00E+4nM. Assay description: Data Source: Sanford-Burnham Center for Chemical Genomics (SBCCG) Source Affiliation: Sanford-Burnham Medical Research Institute (SBMRI, San Diego, C...
In DepthDetails PCBioAssay