BDBM62574 2-(1-keto-4-methyl-phthalazin-2-yl)-N-methyl-acetamide::MLS000030941::N-Methyl-2-(4-methyl-1-oxo-1H-phthalazin-2-yl)-acetamide::N-methyl-2-(4-methyl-1-oxidanylidene-phthalazin-2-yl)ethanamide::N-methyl-2-(4-methyl-1-oxo-2-phthalazinyl)acetamide::N-methyl-2-(4-methyl-1-oxophthalazin-2-yl)acetamide::SMR000010506::cid_655510
SMILES CNC(=O)Cn1nc(C)c2ccccc2c1=O
InChI Key InChIKey=DVSTXZJFAIQFFI-UHFFFAOYSA-N
Data  1 EC50
  Tab Delimited (TSV)   2D SDfile   Computed 3D by Vconf -m prep SDfile
Find this compound or compounds like it in BindingDB:
Activity Spreadsheet -- Enzyme Inhibition Constant Data from BindingDB
Found 1 hit for monomerid = 62574
TargetHeat shock factor protein 1(Mus musculus)
Broad Institute
Curated by PubChem BioAssay
LigandPNGBDBM62574(2-(1-keto-4-methyl-phthalazin-2-yl)-N-methyl-aceta...)
Affinity DataEC50: >1.95E+5nM. Assay description: Keywords: Heat Shock Factor-1 (HSF-1), Stress Response, MG132, NIH3T3, Luminescence Assay Overview: Modified NIH3T3, transformed to express firefly...
In DepthDetails PCBioAssay