BDBM62731 4-[[2-(2,3-dihydro-1,4-benzodioxin-3-yl)-1-oxoethyl]amino]benzoic acid ethyl ester::4-[[2-(2,3-dihydro-1,4-benzodioxin-3-yl)acetyl]amino]benzoic acid ethyl ester::MLS000096870::SMR000074591::cid_2946961::ethyl 4-[(2,3-dihydro-1,4-benzodioxin-2-ylacetyl)amino]benzoate::ethyl 4-[2-(2,3-dihydro-1,4-benzodioxin-3-yl)ethanoylamino]benzoate::ethyl 4-[[2-(2,3-dihydro-1,4-benzodioxin-3-yl)acetyl]amino]benzoate
SMILES CCOC(=O)c1ccc(NC(=O)CC2COc3ccccc3O2)cc1
InChI Key InChIKey=SKOUVYWQSUAILS-UHFFFAOYSA-N
Data  1 EC50
  Tab Delimited (TSV)   2D SDfile   Computed 3D by Vconf -m prep SDfile
Find this compound or compounds like it in BindingDB:
Activity Spreadsheet -- Enzyme Inhibition Constant Data from BindingDB
Found 1 hit for monomerid = 62731
TargetHeat shock factor protein 1(Mus musculus)
Broad Institute
Curated by PubChem BioAssay
LigandPNGBDBM62731(4-[[2-(2,3-dihydro-1,4-benzodioxin-3-yl)-1-oxoethy...)
Affinity DataEC50: >1.95E+5nM. Assay description: Keywords: Heat Shock Factor-1 (HSF-1), Stress Response, MG132, NIH3T3, Luminescence Assay Overview: Modified NIH3T3, transformed to express firefly...
In DepthDetails PCBioAssay