BDBM63116 7-chloranyl-3-oxidanyl-2-[3-(trifluoromethyl)phenyl]quinazolin-4-one::7-chloro-3-hydroxy-2-[3-(trifluoromethyl)phenyl]-4(3H)-quinazolinone::7-chloro-3-hydroxy-2-[3-(trifluoromethyl)phenyl]-4-quinazolinone::7-chloro-3-hydroxy-2-[3-(trifluoromethyl)phenyl]quinazolin-4-one::MLS000326267::SMR000170415::cid_3784439
SMILES On1c(nc2cc(Cl)ccc2c1=O)-c1cccc(c1)C(F)(F)F
InChI Key InChIKey=WLMYZFDFXUHTHH-UHFFFAOYSA-N
Data  2 IC50  1 EC50
  Tab Delimited (TSV)   2D SDfile   Computed 3D by Vconf -m prep SDfile
Find this compound or compounds like it in BindingDB:
Activity Spreadsheet -- Enzyme Inhibition Constant Data from BindingDB
Found 3 hits for monomerid = 63116
TargetHeat shock factor protein 1(Mus musculus)
Broad Institute
Curated by PubChem BioAssay
LigandPNGBDBM63116(7-chloranyl-3-oxidanyl-2-[3-(trifluoromethyl)pheny...)
Affinity DataEC50: >1.95E+5nM. Assay description: Keywords: Heat Shock Factor-1 (HSF-1), Stress Response, MG132, NIH3T3, Luminescence Assay Overview: Modified NIH3T3, transformed to express firefly...
In DepthDetails PCBioAssay
TargetNACHT, LRR and PYD domains-containing protein 3(Homo sapiens (Human))
Burnham Center For Chemical Genomics
Curated by PubChem BioAssay
LigandPNGBDBM63116(7-chloranyl-3-oxidanyl-2-[3-(trifluoromethyl)pheny...)
Affinity DataIC50:  2.67E+3nM. Assay description: Data Source: Sanford-Burnham Center for Chemical Genomics (SBCCG) Source Affiliation: Sanford-Burnham Medical Research Institute (SBMRI, San Diego, C...
In DepthDetails PCBioAssay
TargetNACHT, LRR and PYD domains-containing protein 3(Homo sapiens (Human))
Burnham Center For Chemical Genomics
Curated by PubChem BioAssay
LigandPNGBDBM63116(7-chloranyl-3-oxidanyl-2-[3-(trifluoromethyl)pheny...)
Affinity DataIC50:  1.10E+4nM. Assay description: Data Source: Sanford-Burnham Center for Chemical Genomics (SBCCG) Source Affiliation: Sanford-Burnham Medical Research Institute (SBMRI, San Diego, C...
In DepthDetails PCBioAssay