BDBM6321 6-Acetyl-8-cyclopentyl-5-methyl-2-[5-(4-methyl-piperazin-1-yl)-pyridin-2-ylamino]-8H-pyrido[2,3-d]pyrimidin-7-one::8-cyclopentyl-6-acetyl-5-methyl-2-{[5-(4-methylpiperazin-1-yl)pyridin-2-yl]amino}-7H,8H-pyrido[2,3-d]pyrimidin-7-one::Pyrido-[2,3-d]-pyrimidin-7-one 55
SMILES CN1CCN(CC1)c1ccc(Nc2ncc3c(C)c(C(C)=O)c(=O)n(C4CCCC4)c3n2)nc1
InChI Key InChIKey=PBSZUBKCQUPZFE-UHFFFAOYSA-N
Data  2 IC50
  Tab Delimited (TSV)   2D SDfile   Computed 3D by Vconf -m prep SDfile
Find this compound or compounds like it in BindingDB:
Activity Spreadsheet -- Enzyme Inhibition Constant Data from BindingDB
Found 2 hits for monomerid = 6321
TargetCyclin-A2/Cyclin-dependent kinase 2(Homo sapiens (Human))
Pfizer
LigandPNGBDBM6321(6-Acetyl-8-cyclopentyl-5-methyl-2-[5-(4-methyl-pip...)
Affinity DataIC50: >5.00E+3nM. Assay description: The enzyme was assayed with substrate GST- retinoblastoma in the presence of 12 uM ATP/[gamma-32P] ATP. IC50 is the inhibitor concentration, which in...
In DepthDetails ArticlePubMed
LigandPNGBDBM6321(6-Acetyl-8-cyclopentyl-5-methyl-2-[5-(4-methyl-pip...)
Affinity DataIC50:  5nM. Assay description: The enzyme was assayed with substrate GST- retinoblastoma in the presence of 25 uM ATP/[gamma-32P] ATP. IC50 is the inhibitor concentration, which in...
In DepthDetails ArticlePubMed