BDBM6334 2-Aminoquinazoline 12::N-[3-fluoro-4-(piperazin-1-yl)phenyl]-7-methoxy-8-(propan-2-yl)quinazolin-2-amine
SMILES COc1ccc2cnc(Nc3ccc(N4CCNCC4)c(F)c3)nc2c1C(C)C
InChI Key InChIKey=YTAJPEIDLGHFLU-UHFFFAOYSA-N
Data  4 IC50
  Tab Delimited (TSV)   2D SDfile   Computed 3D by Vconf -m prep SDfile
Find this compound or compounds like it in BindingDB:
Activity Spreadsheet -- Enzyme Inhibition Constant Data from BindingDB
Found 4 hits for monomerid = 6334
TargetCyclin-dependent kinase/G2/mitotic-specific cyclin- 1(Homo sapiens (Human))
Naeja Pharmaceutical
LigandPNGBDBM6334(2-Aminoquinazoline 12 | N-[3-fluoro-4-(piperazin-1...)
Affinity DataIC50:  743nMpH: 7.4 T: 2°C. Assay description: The enzyme was assayed with substrate GST- retinoblastoma in the presence of 12 uM ATP/[gamma-32P] ATP. IC50 is the inhibitor concentration, which in...
In DepthDetails ArticlePubMed
TargetCyclin-dependent kinase 4/G1/S-specific cyclin-D1 [L188C](Homo sapiens (Human))
Naeja Pharmaceutical
LigandPNGBDBM6334(2-Aminoquinazoline 12 | N-[3-fluoro-4-(piperazin-1...)
Affinity DataIC50:  7nM. Assay description: The enzyme was assayed with substrate GST- retinoblastoma in the presence of 25 uM ATP/[gamma-32P] ATP. IC50 is the inhibitor concentration, which in...
In DepthDetails ArticlePubMed
TargetCyclin-dependent kinase 2/G1/S-specific cyclin-E1(Homo sapiens (Human))
Naeja Pharmaceutical
LigandPNGBDBM6334(2-Aminoquinazoline 12 | N-[3-fluoro-4-(piperazin-1...)
Affinity DataIC50:  655nM. Assay description: The enzyme was assayed with substrate GST- retinoblastoma in the presence of 12 uM ATP/[gamma-32P] ATP. IC50 is the inhibitor concentration, which in...
In DepthDetails ArticlePubMed
TargetCyclin-A2/Cyclin-dependent kinase 2(Homo sapiens (Human))
Naeja Pharmaceutical
LigandPNGBDBM6334(2-Aminoquinazoline 12 | N-[3-fluoro-4-(piperazin-1...)
Affinity DataIC50:  141nM. Assay description: The enzyme was assayed with substrate GST- retinoblastoma in the presence of 12 uM ATP/[gamma-32P] ATP. IC50 is the inhibitor concentration, which in...
In DepthDetails ArticlePubMed