BDBM63357 4-(cyclohexylcarbamoylamino)benzoic acid methyl ester::4-[[(cyclohexylamino)-oxomethyl]amino]benzoic acid methyl ester::MLS000683734::SMR000272342::cid_898346::methyl 4-(cyclohexylcarbamoylamino)benzoate::methyl 4-{[(cyclohexylamino)carbonyl]amino}benzoate
SMILES COC(=O)c1ccc(NC(=O)NC2CCCCC2)cc1
InChI Key InChIKey=KVNBYQOKHHJETJ-UHFFFAOYSA-N
Data  1 EC50
  Tab Delimited (TSV)   2D SDfile   Computed 3D by Vconf -m prep SDfile
Find this compound or compounds like it in BindingDB:
Activity Spreadsheet -- Enzyme Inhibition Constant Data from BindingDB
Found 1 hit for monomerid = 63357
TargetHeat shock factor protein 1(Mus musculus)
Broad Institute
Curated by PubChem BioAssay
LigandPNGBDBM63357(4-(cyclohexylcarbamoylamino)benzoic acid methyl es...)
Affinity DataEC50: >1.95E+5nM. Assay description: Keywords: Heat Shock Factor-1 (HSF-1), Stress Response, MG132, NIH3T3, Luminescence Assay Overview: Modified NIH3T3, transformed to express firefly...
In DepthDetails PCBioAssay