BDBM6340 2-Aminoquinazoline 19::8-cyclopentyl-7-methoxy-N-[4-(morpholin-4-yl)phenyl]quinazolin-2-amine
SMILES COc1ccc2cnc(Nc3ccc(cc3)N3CCOCC3)nc2c1C1CCCC1
InChI Key InChIKey=MSFZKJUNFSIHIJ-UHFFFAOYSA-N
Data  4 IC50
  Tab Delimited (TSV)   2D SDfile   Computed 3D by Vconf -m prep SDfile
Find this compound or compounds like it in BindingDB:
Activity Spreadsheet -- Enzyme Inhibition Constant Data from BindingDB
Found 4 hits for monomerid = 6340
TargetCyclin-dependent kinase/G2/mitotic-specific cyclin- 1(Homo sapiens (Human))
Naeja Pharmaceutical
LigandPNGBDBM6340(2-Aminoquinazoline 19 | 8-cyclopentyl-7-methoxy-N-...)
Affinity DataIC50:  1.59E+3nMpH: 7.4 T: 2°C. Assay description: The enzyme was assayed with substrate GST- retinoblastoma in the presence of 12 uM ATP/[gamma-32P] ATP. IC50 is the inhibitor concentration, which in...
In DepthDetails ArticlePubMed
TargetCyclin-dependent kinase 4/G1/S-specific cyclin-D1 [L188C](Homo sapiens (Human))
Naeja Pharmaceutical
LigandPNGBDBM6340(2-Aminoquinazoline 19 | 8-cyclopentyl-7-methoxy-N-...)
Affinity DataIC50:  18nM. Assay description: The enzyme was assayed with substrate GST- retinoblastoma in the presence of 25 uM ATP/[gamma-32P] ATP. IC50 is the inhibitor concentration, which in...
In DepthDetails ArticlePubMed
TargetCyclin-dependent kinase 2/G1/S-specific cyclin-E1(Homo sapiens (Human))
Naeja Pharmaceutical
LigandPNGBDBM6340(2-Aminoquinazoline 19 | 8-cyclopentyl-7-methoxy-N-...)
Affinity DataIC50:  650nM. Assay description: The enzyme was assayed with substrate GST- retinoblastoma in the presence of 12 uM ATP/[gamma-32P] ATP. IC50 is the inhibitor concentration, which in...
In DepthDetails ArticlePubMed
TargetCyclin-A2/Cyclin-dependent kinase 2(Homo sapiens (Human))
Naeja Pharmaceutical
LigandPNGBDBM6340(2-Aminoquinazoline 19 | 8-cyclopentyl-7-methoxy-N-...)
Affinity DataIC50:  384nM. Assay description: The enzyme was assayed with substrate GST- retinoblastoma in the presence of 12 uM ATP/[gamma-32P] ATP. IC50 is the inhibitor concentration, which in...
In DepthDetails ArticlePubMed