BDBM63496 1-{[2-(2-chlorophenyl)-5-methyl-1,3-oxazol-4-yl]methyl}-4-(6-methylpyridin-2-yl)piperazine::2-(2-chlorophenyl)-5-methyl-4-[[4-(6-methyl-2-pyridinyl)-1-piperazinyl]methyl]oxazole::2-(2-chlorophenyl)-5-methyl-4-[[4-(6-methyl-2-pyridyl)piperazino]methyl]oxazole::2-(2-chlorophenyl)-5-methyl-4-[[4-(6-methylpyridin-2-yl)piperazin-1-yl]methyl]-1,3-oxazole::MLS000773200::SMR000317001::cid_16190897
SMILES Cc1oc(nc1CN1CCN(CC1)c1cccc(C)n1)-c1ccccc1Cl
InChI Key InChIKey=PTKXTIOOMSOOCX-UHFFFAOYSA-N
Data  1 EC50
  Tab Delimited (TSV)   2D SDfile   Computed 3D by Vconf -m prep SDfile
Find this compound or compounds like it in BindingDB:
Activity Spreadsheet -- Enzyme Inhibition Constant Data from BindingDB
Found 1 hit for monomerid = 63496
TargetHeat shock factor protein 1(Mus musculus)
Broad Institute
Curated by PubChem BioAssay
LigandPNGBDBM63496(1-{[2-(2-chlorophenyl)-5-methyl-1,3-oxazol-4-yl]me...)
Affinity DataEC50: >1.95E+5nM. Assay description: Keywords: Heat Shock Factor-1 (HSF-1), Stress Response, MG132, NIH3T3, Luminescence Assay Overview: Modified NIH3T3, transformed to express firefly...
In DepthDetails PCBioAssay