BDBM63837 2-chloro-4-methyl-benzoic acid [(Z)-[amino(phenyl)methylene]amino] ester::2-chloro-4-methylbenzoic acid [(Z)-[amino(phenyl)methylidene]amino] ester::MLS000768588::SMR000431909::[(Z)-[amino(phenyl)methylidene]amino] 2-chloro-4-methylbenzoate::[(Z)-[azanyl(phenyl)methylidene]amino] 2-chloranyl-4-methyl-benzoate::cid_5351116
SMILES Cc1ccc(C(=O)ON=C(N)c2ccccc2)c(Cl)c1
InChI Key InChIKey=IKFKASUJAPXLKY-UHFFFAOYSA-N
Data  1 EC50
  Tab Delimited (TSV)   2D SDfile   Computed 3D by Vconf -m prep SDfile
Find this compound or compounds like it in BindingDB:
Activity Spreadsheet -- Enzyme Inhibition Constant Data from BindingDB
Found 1 hit for monomerid = 63837
TargetHeat shock factor protein 1(Mus musculus)
Broad Institute
Curated by PubChem BioAssay
LigandPNGBDBM63837(2-chloro-4-methyl-benzoic acid [(Z)-[amino(phenyl)...)
Affinity DataEC50: <160nM. Assay description: Keywords: Heat Shock Factor-1 (HSF-1), Stress Response, MG132, NIH3T3, Luminescence Assay Overview: Modified NIH3T3, transformed to express firefly...
In DepthDetails PCBioAssay