BDBM64076 4-[2-[(1-propan-2-yl-3-indolyl)methylidene]hydrazinyl]benzoic acid::4-[2-[(1-propan-2-ylindol-3-yl)methylidene]hydrazinyl]benzoic acid::4-[N'-[(1-isopropylindol-3-yl)methylene]hydrazino]benzoic acid::MLS001216467::SMR000544156::cid_4308939
SMILES CC(C)n1cc(CN=Nc2ccc(cc2)C(O)=O)c2ccccc12
InChI Key InChIKey=ONYBUAJHYLWRNF-UHFFFAOYSA-N
Data  1 EC50
  Tab Delimited (TSV)   2D SDfile   Computed 3D by Vconf -m prep SDfile
Find this compound or compounds like it in BindingDB:
Activity Spreadsheet -- Enzyme Inhibition Constant Data from BindingDB
Found 1 hit for monomerid = 64076
TargetHeat shock factor protein 1(Mus musculus)
Broad Institute
Curated by PubChem BioAssay
LigandPNGBDBM64076(4-[2-[(1-propan-2-yl-3-indolyl)methylidene]hydrazi...)
Affinity DataEC50: <160nM. Assay description: Keywords: Heat Shock Factor-1 (HSF-1), Stress Response, MG132, NIH3T3, Luminescence Assay Overview: Modified NIH3T3, transformed to express firefly...
In DepthDetails PCBioAssay