BDBM64087 (5-methyl-3,6-diphenyl-pyrazolo[1,5-a]pyrimidin-7-yl)amine::5-methyl-3,6-diphenyl-7-pyrazolo[1,5-a]pyrimidinamine::5-methyl-3,6-diphenyl-pyrazolo[1,5-a]pyrimidin-7-amine::5-methyl-3,6-diphenylpyrazolo[1,5-a]pyrimidin-7-amine::MLS001198897::SMR000563249::cid_23604753
SMILES Cc1nc2c(cnn2c(N)c1-c1ccccc1)-c1ccccc1
InChI Key InChIKey=LURGPSLQITYUPM-UHFFFAOYSA-N
Data  6 IC50  1 EC50
  Tab Delimited (TSV)   2D SDfile   Computed 3D by Vconf -m prep SDfile
Find this compound or compounds like it in BindingDB:
Activity Spreadsheet -- Enzyme Inhibition Constant Data from BindingDB
Found 7 hits for monomerid = 64087
TargetHeat shock factor protein 1(Mus musculus)
Broad Institute
Curated by PubChem BioAssay
LigandPNGBDBM64087((5-methyl-3,6-diphenyl-pyrazolo[1,5-a]pyrimidin-7-...)
Affinity DataEC50: <160nM. Assay description: Keywords: Heat Shock Factor-1 (HSF-1), Stress Response, MG132, NIH3T3, Luminescence Assay Overview: Modified NIH3T3, transformed to express firefly...
In DepthDetails PCBioAssay
TargetSentrin-specific protease 6(Homo sapiens (Human))
Burnham Center For Chemical Genomics
Curated by PubChem BioAssay
LigandPNGBDBM64087((5-methyl-3,6-diphenyl-pyrazolo[1,5-a]pyrimidin-7-...)
Affinity DataIC50:  8.66E+3nM. Assay description: Data Source: Sanford-Burnham Center for Chemical Genomics (SBCCG) Source Affiliation: Sanford-Burnham Medical Research Institute (SBMRI, San Diego, C...
In DepthDetails PCBioAssay
TargetMitochondrial import inner membrane translocase subunit TIM10(Saccharomyces cerevisiae S288c)
Burnham Center For Chemical Genomics
Curated by PubChem BioAssay
LigandPNGBDBM64087((5-methyl-3,6-diphenyl-pyrazolo[1,5-a]pyrimidin-7-...)
Affinity DataIC50:  2.40E+4nM. Assay description: Data Source: Sanford-Burnham Center for Chemical Genomics (SBCCG) Source Affiliation: Sanford-Burnham Medical Research Institute(SBMRI, San Diego, CA...
In DepthDetails PCBioAssay
TargetTegument protein VP16(Human herpesvirus 1 (strain 17) (HHV-1) (Human her...)
The Scripps Research Institute Molecular Screening Center
Curated by PubChem BioAssay
LigandPNGBDBM64087((5-methyl-3,6-diphenyl-pyrazolo[1,5-a]pyrimidin-7-...)
Affinity DataIC50:  5.97E+4nM. Assay description: Source (MLPCN Center Name): The Scripps Research Institute Molecular Screening Center Affiliation: The Scripps Research Institute, TSRI Assay Provide...
In DepthDetails PCBioAssay
TargetSentrin-specific protease 8(Homo sapiens (Human))
Burnham Center For Chemical Genomics
Curated by PubChem BioAssay
LigandPNGBDBM64087((5-methyl-3,6-diphenyl-pyrazolo[1,5-a]pyrimidin-7-...)
Affinity DataIC50:  1.03E+4nM. Assay description: Data Source: Sanford-Burnham Center for Chemical Genomics (SBCCG) Source Affiliation: Sanford-Burnham Medical Research Institute (SBMRI, San Diego, C...
In DepthDetails PCBioAssay
TargetCOUP transcription factor 2(Homo sapiens (Human))
The Scripps Research Institute Molecular Screening Center
Curated by PubChem BioAssay
LigandPNGBDBM64087((5-methyl-3,6-diphenyl-pyrazolo[1,5-a]pyrimidin-7-...)
Affinity DataIC50: >9.50E+3nM
In DepthDetails PCBioAssay
TargetCaspase-3(Homo sapiens (Human))
Burnham Center For Chemical Genomics
Curated by PubChem BioAssay
LigandPNGBDBM64087((5-methyl-3,6-diphenyl-pyrazolo[1,5-a]pyrimidin-7-...)
Affinity DataIC50:  2.34E+4nM. Assay description: Data Source: Sanford-Burnham Center for Chemical Genomics (SBCCG) Source Affiliation: Sanford-Burnham Medical Research Institute (SBMRI, San Diego, C...
In DepthDetails PCBioAssay