BDBM64131 4-tert-butyl-N-[2-(2-fluoranylphenoxy)ethyl]benzamide::4-tert-butyl-N-[2-(2-fluorophenoxy)ethyl]benzamide::MLS001198370::SMR000559216::cid_609289
SMILES CC(C)(C)c1ccc(cc1)C(=O)NCCOc1ccccc1F
InChI Key InChIKey=ABNROCCIBZCHHF-UHFFFAOYSA-N
Data  1 EC50
  Tab Delimited (TSV)   2D SDfile   Computed 3D by Vconf -m prep SDfile
Find this compound or compounds like it in BindingDB:
Activity Spreadsheet -- Enzyme Inhibition Constant Data from BindingDB
Found 1 hit for monomerid = 64131
TargetHeat shock factor protein 1(Mus musculus)
Broad Institute
Curated by PubChem BioAssay
LigandPNGBDBM64131(4-tert-butyl-N-[2-(2-fluoranylphenoxy)ethyl]benzam...)
Affinity DataEC50: <160nM. Assay description: Keywords: Heat Shock Factor-1 (HSF-1), Stress Response, MG132, NIH3T3, Luminescence Assay Overview: Modified NIH3T3, transformed to express firefly...
In DepthDetails PCBioAssay