BDBM64436 5-[(4-chloranyl-2-methoxy-phenoxy)methyl]-N-[(1-ethylimidazol-2-yl)methyl]-N-methyl-1,2-oxazole-3-carboxamide::5-[(4-chloro-2-methoxy-phenoxy)methyl]-N-[(1-ethylimidazol-2-yl)methyl]-N-methyl-isoxazole-3-carboxamide::5-[(4-chloro-2-methoxyphenoxy)methyl]-N-[(1-ethyl-2-imidazolyl)methyl]-N-methyl-3-isoxazolecarboxamide::5-[(4-chloro-2-methoxyphenoxy)methyl]-N-[(1-ethylimidazol-2-yl)methyl]-N-methyl-1,2-oxazole-3-carboxamide::MLS001090460::SMR000658573::cid_24819330
SMILES CCn1ccnc1CN(C)C(=O)c1cc(COc2ccc(Cl)cc2OC)on1
InChI Key InChIKey=CFHHXNCAJTZQMG-UHFFFAOYSA-N
Data  1 EC50
  Tab Delimited (TSV)   2D SDfile   Computed 3D by Vconf -m prep SDfile
Find this compound or compounds like it in BindingDB:
Activity Spreadsheet -- Enzyme Inhibition Constant Data from BindingDB
Found 1 hit for monomerid = 64436
TargetHeat shock factor protein 1(Mus musculus)
Broad Institute
Curated by PubChem BioAssay
LigandPNGBDBM64436(5-[(4-chloranyl-2-methoxy-phenoxy)methyl]-N-[(1-et...)
Affinity DataEC50: >1.95E+5nM. Assay description: Keywords: Heat Shock Factor-1 (HSF-1), Stress Response, MG132, NIH3T3, Luminescence Assay Overview: Modified NIH3T3, transformed to express firefly...
In DepthDetails PCBioAssay