BDBM67152 4-(phenacylamino)benzoic acid methyl ester::MLS000055399::SMR000066094::cid_788616::methyl 4-(phenacylamino)benzoate
SMILES COC(=O)c1ccc(NCC(=O)c2ccccc2)cc1
InChI Key InChIKey=UGCZUTLGRZMATM-UHFFFAOYSA-N
Data  2 IC50
  Tab Delimited (TSV)   2D SDfile   Computed 3D by Vconf -m prep SDfile
Find this compound or compounds like it in BindingDB:
Activity Spreadsheet -- Enzyme Inhibition Constant Data from BindingDB
Found 2 hits for monomerid = 67152
TargetType-1 angiotensin II receptor(Homo sapiens (Human))
Burnham Center For Chemical Genomics
Curated by PubChem BioAssay
LigandPNGBDBM67152(4-(phenacylamino)benzoic acid methyl ester | MLS00...)
Affinity DataIC50:  1.37E+4nM. Assay description: Data Source: Sanford-Burnham Center for Chemical Genomics (SBCCG) Source Affiliation: Sanford-Burnham Medical Research Institute(SBMRI, San Diego, C...
In DepthDetails PCBioAssay
TargetApelin receptor(Homo sapiens (Human))
Sanford-Burnham Center For Chemical Genomics
Curated by PubChem BioAssay
LigandPNGBDBM67152(4-(phenacylamino)benzoic acid methyl ester | MLS00...)
Affinity DataIC50:  2.29E+4nM. Assay description: Data Source: Sanford-Burnham Center for Chemical Genomics (SBCCG) Source Affiliation: Sanford- Sanford-Burnham Medical Research Institute(SBMRI, San...
In DepthDetails PCBioAssay