BDBM68937 MLS000564455::N-(3-Benzoyl-5-methyl-thiophen-2-yl)-2-morpholin-4-yl-acetamide::N-(3-benzoyl-5-methyl-2-thienyl)-2-morpholino-acetamide::N-(3-benzoyl-5-methyl-2-thiophenyl)-2-(4-morpholinyl)acetamide::N-(3-benzoyl-5-methylthiophen-2-yl)-2-morpholin-4-ylacetamide::N-[5-methyl-3-(phenylcarbonyl)thiophen-2-yl]-2-morpholin-4-yl-ethanamide::SMR000173024::cid_858362
SMILES Cc1cc(C(=O)c2ccccc2)c(NC(=O)CN2CCOCC2)s1
InChI Key InChIKey=TULNLJNPTLDNHX-UHFFFAOYSA-N
Data  1 EC50
  Tab Delimited (TSV)   2D SDfile   Computed 3D by Vconf -m prep SDfile
Find this compound or compounds like it in BindingDB:
Activity Spreadsheet -- Enzyme Inhibition Constant Data from BindingDB
Found 1 hit for monomerid = 68937
TargetGlycogen synthase kinase-3 beta(Homo sapiens (Human))
Broad Institute
Curated by PubChem BioAssay
LigandPNGBDBM68937(MLS000564455 | N-(3-Benzoyl-5-methyl-thiophen-2-yl...)
Affinity DataEC50: >3.00E+5nM. Assay description: Keywords: GSK3beta, dose response, kinase, inhibition, HTS Assay Overview: The glycogen synthase kinase-3 beta (GSK-3b) is a known master regulator f...
In DepthDetails PCBioAssay