BDBM70741 2-Chloro-N-[5-ethyl-3-(4-methyl-benzoyl)-thiophen-2-yl]-acetamide::2-chloranyl-N-[5-ethyl-3-(4-methylphenyl)carbonyl-thiophen-2-yl]ethanamide::2-chloro-N-(5-ethyl-3-p-toluoyl-2-thienyl)acetamide::2-chloro-N-[5-ethyl-3-(4-methylbenzoyl)thiophen-2-yl]acetamide::2-chloro-N-[5-ethyl-3-[(4-methylphenyl)-oxomethyl]-2-thiophenyl]acetamide::MLS000567466::SMR000172752::cid_859639
SMILES CCc1cc(C(=O)c2ccc(C)cc2)c(NC(=O)CCl)s1
InChI Key InChIKey=RUOYSSXJCXTPGP-UHFFFAOYSA-N
Data  1 IC50
  Tab Delimited (TSV)   2D SDfile   Computed 3D by Vconf -m prep SDfile
Find this compound or compounds like it in BindingDB:
Activity Spreadsheet -- Enzyme Inhibition Constant Data from BindingDB
Found 1 hit for monomerid = 70741
TargetProtein RecA(Mycobacterium tuberculosis H37Rv)
Southern Research Specialized Biocontainment Screening Center
Curated by PubChem BioAssay
LigandPNGBDBM70741(2-Chloro-N-[5-ethyl-3-(4-methyl-benzoyl)-thiophen-...)
Affinity DataIC50:  1.25E+3nM. Assay description: Southern Research's Specialized Biocontainment Screening Center (SRSBSC) Southern Research Institute (Birmingham, Alabama) NIH Molecular Librarie...
In DepthDetails PCBioAssay