BDBM70825 2-chloranyl-N-[4-(2,4-dimethylphenyl)sulfanylphenyl]ethanamide::2-chloro-N-[4-(2,4-dimethylphenyl)sulfanylphenyl]acetamide::2-chloro-N-[4-[(2,4-dimethylphenyl)thio]phenyl]acetamide::MLS000334847::SMR000249605::cid_2446597
SMILES Cc1ccc(Sc2ccc(NC(=O)CCl)cc2)c(C)c1
InChI Key InChIKey=HJPLCQSVIMOFKY-UHFFFAOYSA-N
Data  1 IC50  1 EC50
  Tab Delimited (TSV)   2D SDfile   Computed 3D by Vconf -m prep SDfile
Find this compound or compounds like it in BindingDB:
Activity Spreadsheet -- Enzyme Inhibition Constant Data from BindingDB
Found 2 hits for monomerid = 70825
TargetProtein RecA(Mycobacterium tuberculosis H37Rv)
Southern Research Specialized Biocontainment Screening Center
Curated by PubChem BioAssay
LigandPNGBDBM70825(2-chloranyl-N-[4-(2,4-dimethylphenyl)sulfanylpheny...)
Affinity DataIC50:  1.77E+4nM. Assay description: Southern Research's Specialized Biocontainment Screening Center (SRSBSC) Southern Research Institute (Birmingham, Alabama) NIH Molecular Librarie...
In DepthDetails PCBioAssay
TargetHeat shock factor protein 1(Mus musculus)
Broad Institute
Curated by PubChem BioAssay
LigandPNGBDBM70825(2-chloranyl-N-[4-(2,4-dimethylphenyl)sulfanylpheny...)
Affinity DataEC50:  9.67E+3nM. Assay description: Keywords: Heat Shock Factor-1 (HSF-1), Stress Response, MG132, NIH3T3, Luminescence Assay Overview: Confirmation testing of small molecules identifie...
In DepthDetails PCBioAssay