BDBM71231 1H-benzimidazol-2-yl-[(1,2-dimethylindol-3-yl)methyleneamino]amine::MLS000758833::N-(1H-Benzoimidazol-2-yl)-N'-[1-(1,2-dimethyl-1H-indol-3-yl)-meth-(E)-ylidene]-hydrazine::N-[(1,2-dimethyl-3-indolyl)methylideneamino]-1H-benzimidazol-2-amine::N-[(1,2-dimethylindol-3-yl)methylideneamino]-1H-benzimidazol-2-amine::SMR000440092::cid_3695192
SMILES Cc1c(CN=Nc2nc3ccccc3[nH]2)c2ccccc2n1C
InChI Key InChIKey=KHPSJVBYXYSYLY-ZBJSNUHESA-N
Data  1 IC50
  Tab Delimited (TSV)   2D SDfile   Computed 3D by Vconf -m prep SDfile
Find this compound or compounds like it in BindingDB:
Activity Spreadsheet -- Enzyme Inhibition Constant Data from BindingDB
Found 1 hit for monomerid = 71231
TargetProtein RecA(Mycobacterium tuberculosis H37Rv)
Southern Research Specialized Biocontainment Screening Center
Curated by PubChem BioAssay
LigandPNGBDBM71231(1H-benzimidazol-2-yl-[(1,2-dimethylindol-3-yl)meth...)
Affinity DataIC50:  9.50E+3nM. Assay description: Southern Research's Specialized Biocontainment Screening Center (SRSBSC) Southern Research Institute (Birmingham, Alabama) NIH Molecular Librarie...
In DepthDetails PCBioAssay