BDBM71299 2-chloranyl-N-[3-(phenylcarbonyl)thiophen-2-yl]ethanamide::MLS001179446::N-(3-benzoyl-2-thienyl)-2-chloro-acetamide::N-(3-benzoyl-2-thiophenyl)-2-chloroacetamide::N-(3-benzoylthien-2-yl)-2-chloroacetamide::N-(3-benzoylthiophen-2-yl)-2-chloroacetamide::SMR000476452::cid_819037
SMILES ClCC(=O)Nc1sccc1C(=O)c1ccccc1
InChI Key InChIKey=BJVLPJWFHQXLPZ-UHFFFAOYSA-N
Data  1 IC50
  Tab Delimited (TSV)   2D SDfile   Computed 3D by Vconf -m prep SDfile
Find this compound or compounds like it in BindingDB:
Activity Spreadsheet -- Enzyme Inhibition Constant Data from BindingDB
Found 1 hit for monomerid = 71299
TargetProtein RecA(Mycobacterium tuberculosis H37Rv)
Southern Research Specialized Biocontainment Screening Center
Curated by PubChem BioAssay
LigandPNGBDBM71299(2-chloranyl-N-[3-(phenylcarbonyl)thiophen-2-yl]eth...)
Affinity DataIC50:  860nM. Assay description: Southern Research's Specialized Biocontainment Screening Center (SRSBSC) Southern Research Institute (Birmingham, Alabama) NIH Molecular Librarie...
In DepthDetails PCBioAssay