BDBM71445 2-benzylsulfonyl-5-chloro-N-(4-methylphenyl)pyrimidine-4-carboxamide::2-benzylsulfonyl-5-chloro-N-(p-tolyl)pyrimidine-4-carboxamide::5-chloranyl-N-(4-methylphenyl)-2-(phenylmethyl)sulfonyl-pyrimidine-4-carboxamide::5-chloro-N-(4-methylphenyl)-2-(phenylmethyl)sulfonyl-4-pyrimidinecarboxamide::MLS001116165::SMR000625761::cid_16446370
SMILES Cc1ccc(NC(=O)c2nc(ncc2Cl)S(=O)(=O)Cc2ccccc2)cc1
InChI Key InChIKey=PRERTPZNIPPBIT-UHFFFAOYSA-N
Data  4 IC50  1 EC50
  Tab Delimited (TSV)   2D SDfile   Computed 3D by Vconf -m prep SDfile
Find this compound or compounds like it in BindingDB:
Activity Spreadsheet -- Enzyme Inhibition Constant Data from BindingDB
Found 5 hits for monomerid = 71445
TargetNACHT, LRR and PYD domains-containing protein 3(Homo sapiens (Human))
Burnham Center For Chemical Genomics
Curated by PubChem BioAssay
LigandPNGBDBM71445(2-benzylsulfonyl-5-chloro-N-(4-methylphenyl)pyrimi...)
Affinity DataIC50:  3.58E+3nM. Assay description: Data Source: Sanford-Burnham Center for Chemical Genomics (SBCCG) Source Affiliation: Sanford-Burnham Medical Research Institute (SBMRI, San Diego, C...
In DepthDetails PCBioAssay
TargetNACHT, LRR and PYD domains-containing protein 3(Homo sapiens (Human))
Burnham Center For Chemical Genomics
Curated by PubChem BioAssay
LigandPNGBDBM71445(2-benzylsulfonyl-5-chloro-N-(4-methylphenyl)pyrimi...)
Affinity DataIC50:  1.67E+3nM. Assay description: Data Source: Sanford-Burnham Center for Chemical Genomics (SBCCG) Source Affiliation: Sanford-Burnham Medical Research Institute (SBMRI, San Diego, C...
In DepthDetails PCBioAssay
TargetATP-binding cassette sub-family B member 6(Homo sapiens (Human))
Nmmlsc
Curated by PubChem BioAssay
LigandPNGBDBM71445(2-benzylsulfonyl-5-chloro-N-(4-methylphenyl)pyrimi...)
Affinity DataEC50:  3.47E+4nM. Assay description: University of New Mexico Assay Overview: Assay Support: NIH 1 R03 MH093193-01A1 High Throughput Screening for inhibitors of the ABC transporter ABCB6...
In DepthDetails PCBioAssay
TargetBeta-lactamase(Pseudomonas aeruginosa)
The Scripps Research Institute Molecular Screening Center
Curated by PubChem BioAssay
LigandPNGBDBM71445(2-benzylsulfonyl-5-chloro-N-(4-methylphenyl)pyrimi...)
Affinity DataIC50:  8.30E+3nM. Assay description: Source (MLPCN Center Name): The Scripps Research Institute Molecular Screening Center (SRIMSC) Affiliation: The Scripps Research Institute, TSRI Assa...
In DepthDetails PCBioAssay
TargetToll-like receptor 9(Homo sapiens (Human))
The Scripps Research Institute Molecular Screening Center
Curated by PubChem BioAssay
LigandPNGBDBM71445(2-benzylsulfonyl-5-chloro-N-(4-methylphenyl)pyrimi...)
Affinity DataIC50:  1.36E+4nM. Assay description: Source (MLPCN Center Name): The Scripps Research Institute Molecular Screening Center (SRIMSC) Affiliation: The Scripps Research Institute, TSRI Assa...
In DepthDetails PCBioAssay