BDBM71928 4-[3-[4-(4-fluoroanilino)-1-piperidinyl]-2,5-dioxo-1-pyrrolidinyl]benzoic acid ethyl ester::4-[3-[4-(4-fluoroanilino)piperidino]-2,5-diketo-pyrrolidino]benzoic acid ethyl ester::MLS000538863::SMR000144700::cid_2981533::ethyl 4-(3-{4-[(4-fluorophenyl)amino]-1-piperidinyl}-2,5-dioxo-1-pyrrolidinyl)benzoate::ethyl 4-[3-[4-(4-fluoroanilino)piperidin-1-yl]-2,5-dioxopyrrolidin-1-yl]benzoate::ethyl 4-[3-[4-[(4-fluorophenyl)amino]piperidin-1-yl]-2,5-bis(oxidanylidene)pyrrolidin-1-yl]benzoate
SMILES CCOC(=O)c1ccc(cc1)-n1c(O)cc(N2CCC(CC2)Nc2ccc(F)cc2)c1O
InChI Key InChIKey=JTQKZLAONXRQBY-UHFFFAOYSA-N
Data  1 IC50  1 EC50
  Tab Delimited (TSV)   2D SDfile   Computed 3D by Vconf -m prep SDfile
Find this compound or compounds like it in BindingDB:
Activity Spreadsheet -- Enzyme Inhibition Constant Data from BindingDB
Found 2 hits for monomerid = 71928
TargetMitochondrial import inner membrane translocase subunit TIM10(Saccharomyces cerevisiae S288c)
Burnham Center For Chemical Genomics
Curated by PubChem BioAssay
LigandPNGBDBM71928(4-[3-[4-(4-fluoroanilino)-1-piperidinyl]-2,5-dioxo...)
Affinity DataIC50:  5.50E+4nM. Assay description: Data Source: Sanford-Burnham Center for Chemical Genomics (SBCCG) Source Affiliation: Sanford-Burnham Medical Research Institute(SBMRI, San Diego, CA...
In DepthDetails PCBioAssay
TargetHeat shock factor protein 1(Mus musculus)
Broad Institute
Curated by PubChem BioAssay
LigandPNGBDBM71928(4-[3-[4-(4-fluoroanilino)-1-piperidinyl]-2,5-dioxo...)
Affinity DataEC50: >2.60E+5nM. Assay description: Keywords: Heat Shock Factor-1 (HSF-1), Stress Response, MG132, NIH3T3, Luminescence Assay Overview: Confirmation testing of small molecules identifie...
In DepthDetails PCBioAssay