BDBM72682 1-phenyl-2-[1-(phenylcarbonyl)-2H-quinolin-2-yl]ethanone::2-(1-benzoyl-2H-quinolin-2-yl)-1-phenyl-ethanone::2-(1-benzoyl-2H-quinolin-2-yl)-1-phenylethanone::MLS000737777::SMR000528529::cid_272364
SMILES O=C(CC1C=Cc2ccccc2N1C(=O)c1ccccc1)c1ccccc1
InChI Key InChIKey=YEANANYGJKAFAG-UHFFFAOYSA-N
Data  1 EC50
  Tab Delimited (TSV)   2D SDfile   Computed 3D by Vconf -m prep SDfile
Find this compound or compounds like it in BindingDB:
Activity Spreadsheet -- Enzyme Inhibition Constant Data from BindingDB
Found 1 hit for monomerid = 72682
TargetHeat shock factor protein 1(Mus musculus)
Broad Institute
Curated by PubChem BioAssay
LigandPNGBDBM72682(1-phenyl-2-[1-(phenylcarbonyl)-2H-quinolin-2-yl]et...)
Affinity DataEC50: >2.60E+5nM. Assay description: Keywords: Heat Shock Factor-1 (HSF-1), Stress Response, MG132, NIH3T3, Luminescence Assay Overview: Confirmation testing of small molecules identifie...
Ligand InfoPC cidPC sid
In DepthDetails PCBioAssay