BDBM74181 3-[[2-[1-[anilino(oxo)methyl]-3-oxo-2-piperazinyl]-1-oxoethyl]amino]benzoic acid methyl ester::3-[[2-[3-keto-1-(phenylcarbamoyl)piperazin-2-yl]acetyl]amino]benzoic acid methyl ester::MLS001098062::SMR000657666::cid_2814084::methyl 3-({2-[1-(anilinocarbonyl)-3-oxo-2-piperazinyl]acetyl}amino)benzoate::methyl 3-[2-[3-oxidanylidene-1-(phenylcarbamoyl)piperazin-2-yl]ethanoylamino]benzoate::methyl 3-[[2-[3-oxo-1-(phenylcarbamoyl)piperazin-2-yl]acetyl]amino]benzoate
SMILES COC(=O)c1cccc(NC(=O)CC2N(CCNC2=O)C(=O)Nc2ccccc2)c1
InChI Key InChIKey=MJAZREMZASEYEA-UHFFFAOYSA-N
Data  1 EC50
  Tab Delimited (TSV)   2D SDfile   Computed 3D by Vconf -m prep SDfile
Find this compound or compounds like it in BindingDB:
Activity Spreadsheet -- Enzyme Inhibition Constant Data from BindingDB
Found 1 hit for monomerid = 74181
TargetProtein LANA1(Human herpesvirus 8)
Broad Institute
Curated by PubChem BioAssay
LigandPNGBDBM74181(3-[[2-[1-[anilino(oxo)methyl]-3-oxo-2-piperazinyl]...)
Affinity DataEC50:  2.19E+4nM. Assay description: Primary Collaborators: Kenneth Kaye,Brigham & Womens,Boston MA,kkaye@rics.bwh.harvard.edu,617-525-4256 Chantal Beauchemin,Brigham & Womens,Boston MA,...
In DepthDetails PCBioAssay