BDBM74849 (2-oxidanylidenechromen-7-yl) 2-[(4-methylphenyl)sulfonylamino]-2-phenyl-ethanoate::(2-oxochromen-7-yl) 2-[(4-methylphenyl)sulfonylamino]-2-phenylacetate::2-[(4-methylphenyl)sulfonylamino]-2-phenylacetic acid (2-oxo-1-benzopyran-7-yl) ester::2-phenyl-2-(tosylamino)acetic acid (2-ketochromen-7-yl) ester::MLS000588021::Phenyl-(toluene-4-sulfonylamino)-acetic acid 2-oxo-2H-chromen-7-yl ester::SMR000211947::cid_3491650
SMILES Cc1ccc(cc1)S(=O)(=O)NC(C(=O)Oc1ccc2ccc(=O)oc2c1)c1ccccc1
InChI Key InChIKey=CALAKCFBSGTYPW-UHFFFAOYSA-N
Data  1 EC50
  Tab Delimited (TSV)   2D SDfile   Computed 3D by Vconf -m prep SDfile
Find this compound or compounds like it in BindingDB:
Activity Spreadsheet -- Enzyme Inhibition Constant Data from BindingDB
Found 1 hit for monomerid = 74849
TargetImportin subunit alpha-1(Homo sapiens (Human))
Broad Institute
Curated by PubChem BioAssay
LigandPNGBDBM74849((2-oxidanylidenechromen-7-yl) 2-[(4-methylphenyl)s...)
Affinity DataEC50:  2.81E+4nM. Assay description: Keywords: Counterscreen, FRET assay, HTS, YIC probe, Dose response, Assay Overview: This is a fluorescence resonance energy transfer (FRET)-based b...
In DepthDetails PCBioAssay