BDBM75175 3-methyl-N-(8-methyl-1-propyl-3-pyrazolo[3,4-b]quinolinyl)butanamide::3-methyl-N-(8-methyl-1-propyl-pyrazolo[3,4-b]quinolin-3-yl)butanamide::3-methyl-N-(8-methyl-1-propyl-pyrazolo[3,4-b]quinolin-3-yl)butyramide::3-methyl-N-(8-methyl-1-propylpyrazolo[3,4-b]quinolin-3-yl)butanamide::MLS001215237::SMR000543014::cid_1423418
SMILES CCCn1nc(NC(=O)CC(C)C)c2cc3cccc(C)c3nc12
InChI Key InChIKey=ZRHLHQJRYWWUCV-UHFFFAOYSA-N
Data  1 EC50
  Tab Delimited (TSV)   2D SDfile   Computed 3D by Vconf -m prep SDfile
Find this compound or compounds like it in BindingDB:
Activity Spreadsheet -- Enzyme Inhibition Constant Data from BindingDB
Found 1 hit for monomerid = 75175
TargetImportin subunit alpha-1(Homo sapiens (Human))
Broad Institute
Curated by PubChem BioAssay
LigandPNGBDBM75175(3-methyl-N-(8-methyl-1-propyl-3-pyrazolo[3,4-b]qui...)
Affinity DataEC50:  3.18E+4nM. Assay description: Keywords: Counterscreen, FRET assay, HTS, YIC probe, Dose response, Assay Overview: This is a fluorescence resonance energy transfer (FRET)-based b...
In DepthDetails PCBioAssay