BDBM76261 2-[[2-(4-caproylpiperazino)ethylamino]methylene]-5-(2-furyl)cyclohexane-1,3-quinone::5-(2-furanyl)-2-[[2-[4-(1-oxohexyl)-1-piperazinyl]ethylamino]methylidene]cyclohexane-1,3-dione::5-(2-furyl)-2-({[2-(4-hexanoylpiperazin-1-yl)ethyl]amino}methylene)cyclohexane-1,3-dione::5-(furan-2-yl)-2-[[2-(4-hexanoylpiperazin-1-yl)ethylamino]methylidene]cyclohexane-1,3-dione::MLS000042979::SMR000019406::US11529321, Compound 58::cid_3242364
SMILES CCCCCC(=O)N1CCN(CCNC=C2C(=O)CC(CC2=O)c2ccco2)CC1
InChI Key InChIKey=IVWUDBQLFPZGFL-ZPHPHTNESA-N
Data  3 IC50
  Tab Delimited (TSV)   2D SDfile   Computed 3D by Vconf -m prep SDfile
Find this compound or compounds like it in BindingDB:
Activity Spreadsheet -- Enzyme Inhibition Constant Data from BindingDB
Found 3 hits for monomerid = 76261
TargetNACHT, LRR and PYD domains-containing protein 3(Homo sapiens (Human))
Burnham Center For Chemical Genomics
Curated by PubChem BioAssay
LigandPNGBDBM76261(2-[[2-(4-caproylpiperazino)ethylamino]methylene]-5...)
Affinity DataIC50:  7.30E+3nM. Assay description: Data Source: Sanford-Burnham Center for Chemical Genomics (SBCCG) Source Affiliation: Sanford-Burnham Medical Research Institute (SBMRI, San Diego, C...
In DepthDetails PCBioAssay
TargetMicrotubule-associated proteins 1A/1B light chain 3B(Human)
Wigen Biomedicine Technology (Shanghai)
US Patent
LigandPNGBDBM76261(2-[[2-(4-caproylpiperazino)ethylamino]methylene]-5...)
Affinity DataIC50:  9.00E+3nM. Assay description: By constructing a prokaryotic expression system, the LC3B protein was expressed and purified, and a preliminary screening and verification platform w...
In DepthDetails US Patent
TargetNACHT, LRR and PYD domains-containing protein 3(Homo sapiens (Human))
Burnham Center For Chemical Genomics
Curated by PubChem BioAssay
LigandPNGBDBM76261(2-[[2-(4-caproylpiperazino)ethylamino]methylene]-5...)
Affinity DataIC50:  8.62E+3nM. Assay description: Data Source: Sanford-Burnham Center for Chemical Genomics (SBCCG) Source Affiliation: Sanford-Burnham Medical Research Institute (SBMRI, San Diego, C...
In DepthDetails PCBioAssay