BDBM76413 4-[(3-chloro-4-fluoro-phenyl)carbamoylamino]benzoic acid methyl ester::4-[[(3-chloro-4-fluoroanilino)-oxomethyl]amino]benzoic acid methyl ester::MLS000537803::SMR000144041::cid_978194::methyl 4-({[(3-chloro-4-fluorophenyl)amino]carbonyl}amino)benzoate::methyl 4-[(3-chloranyl-4-fluoranyl-phenyl)carbamoylamino]benzoate::methyl 4-[(3-chloro-4-fluorophenyl)carbamoylamino]benzoate
SMILES COC(=O)c1ccc(NC(=O)Nc2ccc(F)c(Cl)c2)cc1
InChI Key InChIKey=IEAQEGSZTNJBFC-UHFFFAOYSA-N
Data  3 IC50
  Tab Delimited (TSV)   2D SDfile   Computed 3D by Vconf -m prep SDfile
Find this compound or compounds like it in BindingDB:
Activity Spreadsheet -- Enzyme Inhibition Constant Data from BindingDB
Found 3 hits for monomerid = 76413
TargetSentrin-specific protease 8(Homo sapiens (Human))
Burnham Center For Chemical Genomics
Curated by PubChem BioAssay
LigandPNGBDBM76413(4-[(3-chloro-4-fluoro-phenyl)carbamoylamino]benzoi...)
Affinity DataIC50: >1.00E+5nM. Assay description: Data Source: Sanford-Burnham Center for Chemical Genomics (SBCCG) Source Affiliation: Sanford-Burnham Medical Research Institute (SBMRI, San Diego, C...
In DepthDetails PCBioAssay
TargetCaspase-3(Homo sapiens (Human))
Burnham Center For Chemical Genomics
Curated by PubChem BioAssay
LigandPNGBDBM76413(4-[(3-chloro-4-fluoro-phenyl)carbamoylamino]benzoi...)
Affinity DataIC50:  4.80E+4nM. Assay description: Data Source: Sanford-Burnham Center for Chemical Genomics (SBCCG) Source Affiliation: Sanford-Burnham Medical Research Institute (SBMRI, San Diego, C...
In DepthDetails PCBioAssay
TargetSentrin-specific protease 6(Homo sapiens (Human))
Burnham Center For Chemical Genomics
Curated by PubChem BioAssay
LigandPNGBDBM76413(4-[(3-chloro-4-fluoro-phenyl)carbamoylamino]benzoi...)
Affinity DataIC50: >1.00E+5nM. Assay description: Data Source: Sanford-Burnham Center for Chemical Genomics (SBCCG) Source Affiliation: Sanford-Burnham Medical Research Institute (SBMRI, San Diego, C...
In DepthDetails PCBioAssay