BDBM77145 9-((R)-2-((Bis(((isopropoxycarbonyl)oxy)methoxy)phosphinyl)methoxy)propyl)adenine::PMPA prodrug::Tenofovir::Tenofovir disoproxil
SMILES CC(C)OC(=O)OCOP(=O)(CO[C@H](C)Cn1cnc2c(N)ncnc12)OCOC(=O)OC(C)C
InChI Key InChIKey=JFVZFKDSXNQEJW-CQSZACIVSA-N
Data  10 IC50
  Tab Delimited (TSV)   2D SDfile   Computed 3D by Vconf -m prep SDfile
Find this compound or compounds like it in BindingDB:
Activity Spreadsheet -- Enzyme Inhibition Constant Data from BindingDB
Found 10 hits for monomerid = 77145
TargetGag-Pol polyprotein [588-1147,M628L,N654N,K657R,T802F,K807E](Human immunodeficiency virus type 1 group M subtyp...)
Chimerix
US Patent
LigandPNGBDBM77145(9-((R)-2-((Bis(((isopropoxycarbonyl)oxy)methoxy)ph...)
Affinity DataIC50:  6.52E+3nM. Assay description: The PhenoSense report form includes drug resistance information for all of the approved nucleoside reverse transcriptase inhibitors (NRTIs), nonnucle...
In DepthDetails US Patent
TargetGag-Pol polyprotein [588-1147,M628L,D654N,M771V,L797W,T802Y](Human immunodeficiency virus type 1 group M subtyp...)
Chimerix
US Patent
LigandPNGBDBM77145(9-((R)-2-((Bis(((isopropoxycarbonyl)oxy)methoxy)ph...)
Affinity DataIC50:  5.39E+3nM. Assay description: The PhenoSense report form includes drug resistance information for all of the approved nucleoside reverse transcriptase inhibitors (NRTIs), nonnucle...
In DepthDetails US Patent
TargetGag-Pol polyprotein [588-1147,M628L,D654N,M771V,L797W,T802Y](Human immunodeficiency virus type 1 group M subtyp...)
Chimerix
US Patent
LigandPNGBDBM77145(9-((R)-2-((Bis(((isopropoxycarbonyl)oxy)methoxy)ph...)
Affinity DataIC50: >8.51E+3nM. Assay description: The PhenoSense report form includes drug resistance information for all of the approved nucleoside reverse transcriptase inhibitors (NRTIs), nonnucle...
In DepthDetails US Patent
TargetGag-Pol polyprotein [588-1147,V662I,F664L,F703Y,Q738M,M771V](Human immunodeficiency virus type 1 group M subtyp...)
Chimerix
US Patent
LigandPNGBDBM77145(9-((R)-2-((Bis(((isopropoxycarbonyl)oxy)methoxy)ph...)
Affinity DataIC50: >6.49E+3nM. Assay description: The PhenoSense report form includes drug resistance information for all of the approved nucleoside reverse transcriptase inhibitors (NRTIs), nonnucle...
In DepthDetails US Patent
TargetBile salt export pump(Homo sapiens (Human))
Amgen
Curated by ChEMBL
LigandPNGBDBM77145(9-((R)-2-((Bis(((isopropoxycarbonyl)oxy)methoxy)ph...)
Affinity DataIC50: >1.33E+5nM. Assay description: Inhibition of human BSEP overexpressed in Sf9 cell membrane vesicles assessed as uptake of [3H]-taurocholate in presence of ATP measured after 15 to ...
In DepthDetails ArticlePubMed
TargetGag-Pol polyprotein [588-1147,K652R,M771V](Human immunodeficiency virus type 1 group M subtyp...)
Chimerix
US Patent
LigandPNGBDBM77145(9-((R)-2-((Bis(((isopropoxycarbonyl)oxy)methoxy)ph...)
Affinity DataIC50:  1.04E+3nM. Assay description: The PhenoSense report form includes drug resistance information for all of the approved nucleoside reverse transcriptase inhibitors (NRTIs), nonnucle...
In DepthDetails US Patent
TargetATP-binding cassette sub-family C member 3(Homo sapiens (Human))
Amgen
Curated by ChEMBL
LigandPNGBDBM77145(9-((R)-2-((Bis(((isopropoxycarbonyl)oxy)methoxy)ph...)
Affinity DataIC50: >1.33E+5nM. Assay description: Inhibition of human MRP3 overexpressed in Sf9 insect cell membrane vesicles assessed as uptake of [3H]-estradiol-17beta-D-glucuronide in presence of ...
In DepthDetails ArticlePubMed
TargetATP-binding cassette sub-family C member 2(Homo sapiens (Human))
Amgen
Curated by ChEMBL
LigandPNGBDBM77145(9-((R)-2-((Bis(((isopropoxycarbonyl)oxy)methoxy)ph...)
Affinity DataIC50: >1.33E+5nM. Assay description: Inhibition of human MRP2 overexpressed in Sf9 cell membrane vesicles assessed as uptake of [3H]-estradiol-17beta-D-glucuronide in presence of ATP and...
In DepthDetails ArticlePubMed
TargetATP-binding cassette sub-family C member 4(Homo sapiens (Human))
Amgen
Curated by ChEMBL
LigandPNGBDBM77145(9-((R)-2-((Bis(((isopropoxycarbonyl)oxy)methoxy)ph...)
Affinity DataIC50: >1.33E+5nM. Assay description: Inhibition of human MRP4 overexpressed in Sf9 cell membrane vesicles assessed as uptake of [3H]-estradiol-17beta-D-glucuronide in presence of ATP and...
In DepthDetails ArticlePubMed
TargetGag-Pol polyprotein [588-1147,M628L,T656S,M771V,L797W,T802Y](Human immunodeficiency virus type 1 group M subtyp...)
Chimerix
US Patent
LigandPNGBDBM77145(9-((R)-2-((Bis(((isopropoxycarbonyl)oxy)methoxy)ph...)
Affinity DataIC50: >6.47E+3nM. Assay description: The PhenoSense report form includes drug resistance information for all of the approved nucleoside reverse transcriptase inhibitors (NRTIs), nonnucle...
In DepthDetails US Patent