BDBM77540 4-[2-(5,6-Dimethyl-benzoimidazol-1-yl)-acetylamino]-benzoic acid ethyl ester::4-[[2-(5,6-dimethyl-1-benzimidazolyl)-1-oxoethyl]amino]benzoic acid ethyl ester::4-[[2-(5,6-dimethylbenzimidazol-1-yl)acetyl]amino]benzoic acid ethyl ester::MLS000526072::SMR000116546::cid_1147047::ethyl 4-[2-(5,6-dimethylbenzimidazol-1-yl)ethanoylamino]benzoate::ethyl 4-[[2-(5,6-dimethylbenzimidazol-1-yl)acetyl]amino]benzoate
SMILES CCOC(=O)c1ccc(NC(=O)Cn2cnc3cc(C)c(C)cc23)cc1
InChI Key InChIKey=LDUSQOLOWBFELC-UHFFFAOYSA-N
Data  3 IC50
  Tab Delimited (TSV)   2D SDfile   Computed 3D by Vconf -m prep SDfile
Find this compound or compounds like it in BindingDB:
Activity Spreadsheet -- Enzyme Inhibition Constant Data from BindingDB
Found 3 hits for monomerid = 77540
TargetRecBCD enzyme subunit RecD(Escherichia coli str. K-12 substr. MG1655)
The Scripps Research Institute Molecular Screening Center
Curated by PubChem BioAssay
LigandPNGBDBM77540(4-[2-(5,6-Dimethyl-benzoimidazol-1-yl)-acetylamino...)
Affinity DataIC50: >1.19E+5nM. Assay description: Source (MLPCN Center Name): The Scripps Research Institute Molecular Screening Center (SRIMSC) Affiliation: The Scripps Research Institute, TSRI Assa...
Ligand InfoPC cidPC sid
In DepthDetails PCBioAssay
TargetProtein Wnt-3a(Mus musculus)
Burnham Center For Chemical Genomics
Curated by PubChem BioAssay
LigandPNGBDBM77540(4-[2-(5,6-Dimethyl-benzoimidazol-1-yl)-acetylamino...)
Affinity DataIC50:  931nM
Ligand InfoPC cidPC sid
In DepthDetails PCBioAssay
TargetZinc finger protein GLI1(Mus musculus)
Burnham Center For Chemical Genomics
Curated by PubChem BioAssay
LigandPNGBDBM77540(4-[2-(5,6-Dimethyl-benzoimidazol-1-yl)-acetylamino...)
Affinity DataIC50:  2.75E+3nM. Assay description: Data Source: Sanford-Burnham Center for Chemical Genomics (SBCCG) Source Affiliation: Sanford-Burnham Medical Research Institute (SBMRI, San Diego, C...
Ligand InfoPC cidPC sid
In DepthDetails PCBioAssay