BDBM78754 6-methyl-2-[(4-methylpiperazino)thiocarbamoylamino]-4,5,6,7-tetrahydrobenzothiophene-3-carboxylic acid methyl ester::6-methyl-2-[[[(4-methyl-1-piperazinyl)amino]-sulfanylidenemethyl]amino]-4,5,6,7-tetrahydro-1-benzothiophene-3-carboxylic acid methyl ester::MLS000665899::SMR000294585::cid_2957979::methyl 6-methyl-2-({[(4-methyl-1-piperazinyl)amino]carbonothioyl}amino)-4,5,6,7-tetrahydro-1-benzothiophene-3-carboxylate::methyl 6-methyl-2-[(4-methylpiperazin-1-yl)carbamothioylamino]-4,5,6,7-tetrahydro-1-benzothiophene-3-carboxylate
SMILES COC(=O)c1c(NC(=S)NN2CCN(C)CC2)sc2CC(C)CCc12
InChI Key InChIKey=FPUGRWXWXIKFML-UHFFFAOYSA-N
Data  1 IC50
  Tab Delimited (TSV)   2D SDfile   Computed 3D by Vconf -m prep SDfile
Find this compound or compounds like it in BindingDB:
Activity Spreadsheet -- Enzyme Inhibition Constant Data from BindingDB
Found 1 hit for monomerid = 78754
TargetUbiquitin-conjugating enzyme E2 N(Homo sapiens (Human))
Burnham Center For Chemical Genomics
Curated by PubChem BioAssay
LigandPNGBDBM78754(6-methyl-2-[(4-methylpiperazino)thiocarbamoylamino...)
Affinity DataIC50: >2.00E+4nM. Assay description: Data Source: Sanford-Burnham Center for Chemical Genomics (SBCCG) Source Affiliation: Sanford-Burnham Medical Research Institute (SBMRI, San Diego CA...
In DepthDetails PCBioAssay