BDBM79206 1-(4-(4-chlorophenyl)-2-(2,6-dichlorophenylthio)-n-butyl)-1H-imidazole::BUTOCONAZOLE NITRATE::Butoconazole::Femstal::Femstat::MLS002153798::Mycelex-3::RS 35887::SMR001233176::cid_47471
SMILES Clc1ccc(CCC(Cn2ccnc2)Sc2c(Cl)cccc2Cl)cc1
InChI Key InChIKey=SWLMUYACZKCSHZ-UHFFFAOYSA-N
Data  1 IC50
  Tab Delimited (TSV)   2D SDfile   Computed 3D by Vconf -m prep SDfile
Find this compound or compounds like it in BindingDB:
Activity Spreadsheet -- Enzyme Inhibition Constant Data from BindingDB
Found 1 hit for monomerid = 79206
TargetUbiquitin-conjugating enzyme E2 N(Homo sapiens (Human))
Burnham Center For Chemical Genomics
Curated by PubChem BioAssay
LigandPNGBDBM79206(1-(4-(4-chlorophenyl)-2-(2,6-dichlorophenylthio)-n...)
Affinity DataIC50: >2.00E+4nM. Assay description: Data Source: Sanford-Burnham Center for Chemical Genomics (SBCCG) Source Affiliation: Sanford-Burnham Medical Research Institute (SBMRI, San Diego CA...
In DepthDetails PCBioAssay