BDBM81677 CARB-KB32
SMILES CNC(=O)CCC(=O)N[C@@H](Cc1ccccc1)[C@H](O)CN(C[C@@H](C)O)S(=O)(=O)c1cccc(OC)c1
InChI Key InChIKey=PUILPMKESPMMSZ-YFXJRYMSSA-N
Data  3 KI
  Tab Delimited (TSV)   2D SDfile   Computed 3D by Vconf -m prep SDfile
Find this compound or compounds like it in BindingDB:
Activity Spreadsheet -- Enzyme Inhibition Constant Data from BindingDB
Found 1 hit for monomerid = 81677
TargetHIV-1 protease(Human immunodeficiency virus)
University Of Maryland
LigandPNGBDBM81677(CARB-KB32)
Affinity DataKi:  760nM. Assay description: Inhibition assay using HIV protease and Sulfonamide compounds.
In DepthDetails ArticlePubMed