BDBM82091 CAS_19313-28-1::PGE0::PGE1, 13,14-dihydro
SMILES CCCCC[C@H](O)CC[C@H]1[C@H](O)CC(=O)[C@@H]1CCCCCCC(O)=O
InChI Key InChIKey=DPOINJQWXDTOSF-DODZYUBVSA-N
Data  2 KI
  Tab Delimited (TSV)   2D SDfile   Computed 3D by Vconf -m prep SDfile
Find this compound or compounds like it in BindingDB:
Activity Spreadsheet -- Enzyme Inhibition Constant Data from BindingDB
Found 1 hit for monomerid = 82091
TargetProstacyclin receptor(MOUSE)
Royal Postgraduate Medical School
Curated by PDSP Ki Database
LigandPNGBDBM82091(CAS_19313-28-1 | PGE0 | PGE1, 13,14-dihydro)
Affinity DataKi:  315nM
In DepthDetails ArticlePubMed