BDBM83237 1-(2-benzoyl-4-chloro-phenyl)-3-pyrroline-2,5-quinone::1-(2-benzoyl-4-chlorophenyl)pyrrole-2,5-dione::1-[4-chloranyl-2-(phenylcarbonyl)phenyl]pyrrole-2,5-dione::MLS001061331::SMR000384940::cid_304835
SMILES Clc1ccc(N2C(=O)C=CC2=O)c(c1)C(=O)c1ccccc1
InChI Key InChIKey=NJMSTNJRQFSDPW-UHFFFAOYSA-N
Data  3 IC50
  Tab Delimited (TSV)   2D SDfile   Computed 3D by Vconf -m prep SDfile
Find this compound or compounds like it in BindingDB:
Activity Spreadsheet -- Enzyme Inhibition Constant Data from BindingDB
Found 3 hits for monomerid = 83237
TargetToll-like receptor 9(Homo sapiens (Human))
The Scripps Research Institute Molecular Screening Center
Curated by PubChem BioAssay
LigandPNGBDBM83237(1-(2-benzoyl-4-chloro-phenyl)-3-pyrroline-2,5-quin...)
Affinity DataIC50:  8.46E+3nM. Assay description: Source (MLPCN Center Name): The Scripps Research Institute Molecular Screening Center (SRIMSC) Affiliation: The Scripps Research Institute, TSRI Assa...
In DepthDetails PCBioAssay
TargetEndothelial PAS domain-containing protein 1(Homo sapiens (Human))
Burnham Center For Chemical Genomics
Curated by PubChem BioAssay
LigandPNGBDBM83237(1-(2-benzoyl-4-chloro-phenyl)-3-pyrroline-2,5-quin...)
Affinity DataIC50:  6.91E+3nM
In DepthDetails PCBioAssay
TargetBeta-lactamase(Pseudomonas aeruginosa)
The Scripps Research Institute Molecular Screening Center
Curated by PubChem BioAssay
LigandPNGBDBM83237(1-(2-benzoyl-4-chloro-phenyl)-3-pyrroline-2,5-quin...)
Affinity DataIC50:  1.47E+4nM. Assay description: Source (MLPCN Center Name): The Scripps Research Institute Molecular Screening Center (SRIMSC) Affiliation: The Scripps Research Institute, TSRI Assa...
In DepthDetails PCBioAssay