BDBM8332 4-(morpholin-4-yl)-N-{5-phenyl-1H-pyrazolo[3,4-c]pyridazin-3-yl}butanamide::pyrazolopyridazine deriv. 12
SMILES O=C(CCCN1CCOCC1)Nc1n[nH]c2nnc(cc12)-c1ccccc1
InChI Key InChIKey=WZEMTZHNQZDUFC-UHFFFAOYSA-N
Data  2 IC50
  Tab Delimited (TSV)   2D SDfile   Computed 3D by Vconf -m prep SDfile
Find this compound or compounds like it in BindingDB:
Activity Spreadsheet -- Enzyme Inhibition Constant Data from BindingDB
Found 2 hits for monomerid = 8332
TargetGlycogen synthase kinase-3 beta(Homo sapiens (Human))
University Of Jordan
Curated by ChEMBL
LigandPNGBDBM8332(4-(morpholin-4-yl)-N-{5-phenyl-1H-pyrazolo[3,4-c]p...)
Affinity DataIC50:  5nM. Assay description: Inhibition of recombinant GSK3-beta
In DepthDetails ArticlePubMed
TargetGlycogen synthase kinase-3 alpha(Homo sapiens (Human))
Glaxosmithkline
LigandPNGBDBM8332(4-(morpholin-4-yl)-N-{5-phenyl-1H-pyrazolo[3,4-c]p...)
Affinity DataIC50:  5nMpH: 7.0 T: 2°C. Assay description: The biochemical activity of compounds was determined by incubation with specific enzyme and substrate in the presence 10 uM ATP/ [gamma-33P] ATP. Aft...
In DepthDetails ArticlePubMed