BDBM8351 6-aryl-pyrazolo[3,4-b]pyridine analogue 15::N-[6-(4-hydroxyphenyl)-5-methyl-1H-pyrazolo[3,4-b]pyridin-3-yl]cyclopropanecarboxamide
SMILES Cc1cc2c(NC(=O)C3CC3)n[nH]c2nc1-c1ccc(O)cc1
InChI Key InChIKey=BGVFZHIFEQILLB-UHFFFAOYSA-N
Data  2 IC50
  Tab Delimited (TSV)   2D SDfile   Computed 3D by Vconf -m prep SDfile
Find this compound or compounds like it in BindingDB:
Activity Spreadsheet -- Enzyme Inhibition Constant Data from BindingDB
Found 2 hits for monomerid = 8351
TargetGlycogen synthase kinase-3 beta(Homo sapiens (Human))
University Of Jordan
Curated by ChEMBL
LigandPNGBDBM8351(6-aryl-pyrazolo[3,4-b]pyridine analogue 15 | N-[6-...)
Affinity DataIC50:  6nM. Assay description: Inhibition of recombinant GSK3-beta
In DepthDetails ArticlePubMed
TargetGlycogen synthase kinase-3 alpha(Homo sapiens (Human))
Glaxosmithkline
LigandPNGBDBM8351(6-aryl-pyrazolo[3,4-b]pyridine analogue 15 | N-[6-...)
Affinity DataIC50:  6nMpH: 7.0 T: 2°C. Assay description: The biochemical activity of compounds was determined by incubation with specific enzyme and substrate in the presence 10 uM ATP/ [gamma-33P] ATP. Aft...
In DepthDetails ArticlePubMed