BDBM8365 N-[6-(3-chloro-4-hydroxyphenyl)-1H-pyrazolo[3,4-b]pyridin-3-yl]cyclopropanecarboxamide::pyrazolo[3,4-b]pyridine analogue 7
SMILES Oc1ccc(cc1Cl)-c1ccc2c(NC(=O)C3CC3)n[nH]c2n1
InChI Key InChIKey=DTTIISYOYISNJH-UHFFFAOYSA-N
Data  3 IC50
  Tab Delimited (TSV)   2D SDfile   Computed 3D by Vconf -m prep SDfile
Find this compound or compounds like it in BindingDB:
Activity Spreadsheet -- Enzyme Inhibition Constant Data from BindingDB
Found 3 hits for monomerid = 8365
TargetGlycogen synthase kinase-3 alpha(Homo sapiens (Human))
Glaxosmithkline
LigandPNGBDBM8365(N-[6-(3-chloro-4-hydroxyphenyl)-1H-pyrazolo[3,4-b]...)
Affinity DataIC50:  7nM. Assay description: The biochemical activity of compounds was determined by incubation with specific enzyme and substrate in the presence 10 uM ATP/ [gamma-33P] ATP. Aft...
In DepthDetails ArticlePubMed
TargetGlycogen synthase kinase-3 beta(Homo sapiens (Human))
University Of Jordan
Curated by ChEMBL
LigandPNGBDBM8365(N-[6-(3-chloro-4-hydroxyphenyl)-1H-pyrazolo[3,4-b]...)
Affinity DataIC50:  7nM. Assay description: Inhibition of recombinant GSK3-beta
In DepthDetails ArticlePubMed
TargetCyclin-A2/Cyclin-dependent kinase 2(Homo sapiens (Human))
Glaxosmithkline
LigandPNGBDBM8365(N-[6-(3-chloro-4-hydroxyphenyl)-1H-pyrazolo[3,4-b]...)
Affinity DataIC50:  2nM. Assay description: In vitro kinase assay using purified CDK2/Cyclin A was incubated at room temperature with substrate, and test compounds in the presence of 100 uM ATP...
In DepthDetails ArticlePubMed