BDBM8386 CHEMBL260243::N-[6-(furan-3-yl)-1H-indazol-3-yl]cyclopropanecarboxamide::indazole analogue 28
SMILES O=C(Nc1n[nH]c2cc(ccc12)-c1ccoc1)C1CC1
InChI Key InChIKey=XOCIRJMUBXHWBK-UHFFFAOYSA-N
Data  4 IC50
  Tab Delimited (TSV)   2D SDfile   Computed 3D by Vconf -m prep SDfile
Find this compound or compounds like it in BindingDB:
Activity Spreadsheet -- Enzyme Inhibition Constant Data from BindingDB
Found 4 hits for monomerid = 8386
TargetGlycogen synthase kinase-3 alpha(Homo sapiens (Human))
Glaxosmithkline
LigandPNGBDBM8386(CHEMBL260243 | N-[6-(furan-3-yl)-1H-indazol-3-yl]c...)
Affinity DataIC50:  35nM. Assay description: The biochemical activity of compounds was determined by incubation with specific enzyme and substrate in the presence 10 uM ATP/ [gamma-33P] ATP. Aft...
In DepthDetails ArticlePubMed
TargetGlycogen synthase kinase-3 beta(Homo sapiens (Human))
University Of Jordan
Curated by ChEMBL
LigandPNGBDBM8386(CHEMBL260243 | N-[6-(furan-3-yl)-1H-indazol-3-yl]c...)
Affinity DataIC50:  35nM. Assay description: Inhibition of recombinant GSK3-beta
In DepthDetails ArticlePubMed
TargetCyclin-dependent kinase 2(Homo sapiens (Human))
National Institute Of Pharmaceutical Education And Research
Curated by ChEMBL
LigandPNGBDBM8386(CHEMBL260243 | N-[6-(furan-3-yl)-1H-indazol-3-yl]c...)
Affinity DataIC50: >1.00E+3nM. Assay description: Inhibition of CDK2 (unknown origin)
In DepthDetails ArticlePubMed
TargetCyclin-A2/Cyclin-dependent kinase 2(Homo sapiens (Human))
Glaxosmithkline
LigandPNGBDBM8386(CHEMBL260243 | N-[6-(furan-3-yl)-1H-indazol-3-yl]c...)
Affinity DataIC50: >1.00E+3nM. Assay description: In vitro kinase assay using purified CDK2/Cyclin A was incubated at room temperature with substrate, and test compounds in the presence of 100 uM ATP...
In DepthDetails ArticlePubMed