BDBM84728 nafarelin 5NMeTyr
SMILES CC(C)C[C@H](NC(=O)[C@@H](Cc1ccc2ccccc2c1)NC(=O)[C@H](Cc1ccc(O)cc1)N(C)C(=O)[C@H](CO)NC(=O)[C@H](Cc1c[nH]c2ccccc12)NC(=O)[C@H](Cc1cnc[nH]1)NC(=O)[C@@H]1CCC(=O)N1)C(=O)N[C@@H](CCCN=C(N)N)C(=O)N1CCC[C@H]1C(=O)NCC(N)=O
InChI Key InChIKey=AWGRFBORXHTGPL-XBXXFZRPSA-N
Data  1 KI
  Tab Delimited (TSV)   2D SDfile   Computed 3D by Vconf -m prep SDfile
Find this compound or compounds like it in BindingDB:
Activity Spreadsheet -- Enzyme Inhibition Constant Data from BindingDB
Found 1 hit for monomerid = 84728
TargetProgonadoliberin-1(RAT)
Abbott Laboratories
Curated by PDSP Ki Database
LigandPNGBDBM84728(nafarelin 5NMeTyr)
Affinity DataKi:  0.0300nM
In DepthDetails ArticlePubMed