BDBM86174 CAS_486-12-4::NSC_5282443::Triprolidine
SMILES Cc1ccc(cc1)C(=CCN1CCCC1)c1ccccn1
InChI Key InChIKey=CBEQULMOCCWAQT-UHFFFAOYSA-N
Data  3 KI
  Tab Delimited (TSV)   2D SDfile   Computed 3D by Vconf -m prep SDfile
Find this compound or compounds like it in BindingDB:
Activity Spreadsheet -- Enzyme Inhibition Constant Data from BindingDB
Found 1 hit for monomerid = 86174
TargetHistamine H1 receptor(Cavia porcellus (domestic guinea pig))
University Of North Carolina At Chapel Hill
Curated by PDSP Ki Database
LigandPNGBDBM86174(CAS_486-12-4 | NSC_5282443 | Triprolidine)
Affinity DataKi:  0.930nM
In DepthDetails ArticlePubMed