BDBM86425 CAS_27350::NSC_27350::Pancuronium
SMILES CC(=O)OC1C(CC2C3CCC4CC(OC(C)=O)C(CC4(C)C3CCC12C)[N+]1(C)CCCCC1)[N+]1(C)CCCCC1
InChI Key InChIKey=GVEAYVLWDAFXET-UHFFFAOYSA-N
Data  1 KI
  Tab Delimited (TSV)   2D SDfile   Computed 3D by Vconf -m prep SDfile
Find this compound or compounds like it in BindingDB:
Activity Spreadsheet -- Enzyme Inhibition Constant Data from BindingDB
Found 1 hit for monomerid = 86425
TargetNeuronal acetylcholine receptor subunit alpha-4(Homo sapiens (Human))
Barrow Neurological Institute
Curated by PDSP Ki Database
LigandPNGBDBM86425(CAS_27350 | NSC_27350 | Pancuronium)
Affinity DataKi: >1.00E+4nM
In DepthDetails ArticlePubMed