BDBM86427 CAS_50-37-3::LSD::NSC_3981
SMILES CCN(CC)C(=O)C1CN(C)C2Cc3c[nH]c4cccc(C2=C1)c34
InChI Key InChIKey=VAYOSLLFUXYJDT-UHFFFAOYSA-N
Data  6 KI
PDB links: 6 PDB IDs match this monomer.
  Tab Delimited (TSV)   2D SDfile   Computed 3D by Vconf -m prep SDfile
Find this compound or compounds like it in BindingDB:
Activity Spreadsheet -- Enzyme Inhibition Constant Data from BindingDB
Found 6 hits for monomerid = 86427
Target5-hydroxytryptamine receptor 2A(Homo sapiens (Human))
Vernalis Research
Curated by PDSP Ki Database
LigandPNGBDBM86427(CAS_50-37-3 | LSD | NSC_3981)
Affinity DataKi:  0.760nM
Target5-hydroxytryptamine receptor 2B(Homo sapiens (Human))
Vernalis Research
Curated by PDSP Ki Database
LigandPNGBDBM86427(CAS_50-37-3 | LSD | NSC_3981)
Affinity DataKi:  0.980nM
Target5-hydroxytryptamine receptor 2C(Homo sapiens (Human))
Vernalis Research
Curated by PDSP Ki Database
LigandPNGBDBM86427(CAS_50-37-3 | LSD | NSC_3981)
Affinity DataKi:  1.10nM
In DepthDetails ArticlePubMed
Target5-hydroxytryptamine receptor 6(Homo sapiens (Human))
Glaxosmithkline
Curated by PDSP Ki Database
LigandPNGBDBM86427(CAS_50-37-3 | LSD | NSC_3981)
Affinity DataKi:  2.29nM
In DepthDetails ArticlePubMed
Target5-hydroxytryptamine receptor 6(RAT)
Glaxosmithkline
Curated by PDSP Ki Database
LigandPNGBDBM86427(CAS_50-37-3 | LSD | NSC_3981)
Affinity DataKi:  2.63nM
In DepthDetails ArticlePubMed
Target5-hydroxytryptamine receptor 6(MOUSE)
Glaxosmithkline
Curated by PDSP Ki Database
LigandPNGBDBM86427(CAS_50-37-3 | LSD | NSC_3981)
Affinity DataKi:  2.82nM
In DepthDetails ArticlePubMed