BDBM8760 1,2,3,4-Tetrahydropyrido[3,4-b]indole 5::2-benzoyl-1,2,3,4-tetrahydro-9H-pyrido[3,4-b]indole::2-benzoyl-1H,2H,3H,4H,9H-pyrido[3,4-b]indole
SMILES O=C(N1CCc2c(C1)[nH]c1ccccc21)c1ccccc1
InChI Key InChIKey=WQRXDRGZIIXKAK-UHFFFAOYSA-N
Data  1 IC50
  Tab Delimited (TSV)   2D SDfile   Computed 3D by Vconf -m prep SDfile
Find this compound or compounds like it in BindingDB:
Activity Spreadsheet -- Enzyme Inhibition Constant Data from BindingDB
Found 1 hit for monomerid = 8760
TargetEnoyl-[acyl-carrier-protein] reductase [NADPH] FabI(Staphylococcus aureus)
Glaxosmithkline
LigandPNGBDBM8760(1,2,3,4-Tetrahydropyrido[3,4-b]indole 5 | 2-benzoy...)
Affinity DataIC50:  2.70E+3nMpH: 6.5 T: 2°C. Assay description: Assays were carried out in half-area, 96-well microtiter plates. Compounds were evaluated in assay mixtures containing components specific for each e...
In DepthDetails ArticlePubMed