BDBM88567 US10189794, Compound I-9::US10618902, Compound I-9::US10774052, Compound I-9::US9695132, I-9
SMILES CCC(=O)Nc1cccc(CN2C(=O)N(Cc3cnc(Nc4ccc(cc4NC(=O)C=C)N4CCN(CCOC)CC4)nc23)c2cc(OC)cc(OC)c2)c1
InChI Key InChIKey=YCAVSCMXPKCOTK-UHFFFAOYSA-N
Data  4 IC50
  Tab Delimited (TSV)   2D SDfile   Computed 3D by Vconf -m prep SDfile
Find this compound or compounds like it in BindingDB:
Activity Spreadsheet -- Enzyme Inhibition Constant Data from BindingDB
Found 4 hits for monomerid = 88567
TargetFibroblast growth factor receptor 4(Homo sapiens (Human))
Celgene Car
US Patent
LigandPNGBDBM88567(US10189794, Compound I-9 | US10618902, Compound I-...)
Affinity DataIC50: <100nMpH: 7.5Assay Description:Omnia Assay Protocol for Potency Assessment Against FGFR 4 Enzyme. b) [FGFR4-WT]=2.5 nM, [ATP]=250 uM, [Y10-Sox]=10 uM (ATP KMapp 250 uM): A 10x stoc...
In DepthDetails US Patent
TargetFibroblast growth factor receptor 4(Homo sapiens (Human))
Celgene Car
US Patent
LigandPNGBDBM88567(US10189794, Compound I-9 | US10618902, Compound I-...)
Affinity DataIC50: <100nM. Assay description: MDA-MB-453 and Huh7 cells were grown in 96-well poly-D-lysine plates (BD Bioscience, San Jose, Calif.) to 90% confluence. The cells were then incubat...
In DepthDetails US Patent
TargetFibroblast growth factor receptor 4(Homo sapiens (Human))
Celgene Car
US Patent
LigandPNGBDBM88567(US10189794, Compound I-9 | US10618902, Compound I-...)
Affinity DataIC50: <500nM. Assay description: A 10× stock solution of FGFR4-WT (PR4380C or P3054), (from Invitrogen, Carlsbad, Calif.) corresponding to method a in Table 10, was prepared as descr...
In DepthDetails US Patent
TargetFibroblast growth factor receptor 4(Homo sapiens (Human))
Celgene Car
US Patent
LigandPNGBDBM88567(US10189794, Compound I-9 | US10618902, Compound I-...)
Affinity DataIC50: <100nM. Assay description: A 10× stock solution of FGFR4-WT (PR4380C), (from Invitrogen, Carlsbad, Calif.) corresponding to method a in Table 7, was prepared as described below...
In DepthDetails US Patent